ترمز برقی‌بادی
preferred label: electro-pneumatic brake @en
type: Concept
narrower: ترمز برقی‌بادی غیرمستقیم

ترمز برقی‌بادی غیرمستقیم
scope note: سامانۀ ترمزی که در آن فشار هوا در لولۀ ترمز تحت تأثیر شیر برقی (electrical brake solenoid valve) قرار می‌گیرد.
broader: ترمز برقی‌بادی
preferred label: indirect electro-pneumatic brake @en
type: Concept