ترمز سراسری
scope note: سامانۀ ترمزی که با آن ترمزگیری کل قطار ازطریق لوکوموتیو انجام می‌شود
broader: ترمز
preferred label: through brake @en
type: Concept

ترمز
preferred label: brake @en
type: Concept
narrower: ترمز سراسری