کوره اتاقکی
scope note: کوره‌ای جعبه‌ای‌شکل که بدنه‌ها در آن پخته می‌شوند.
broader: کوره
preferred label: box furnace @en
type: Concept

کوره
preferred label: furnace @en
type: Concept
narrower: کوره اتاقکی