کوره مداوم
preferred label: continuous furnace @en
type: Concept
narrower: کوره پیش‌بر

کوره پیش‌بر
scope note: نوعی کورۀ مداوم که در آن قطعات را به‌تناوب درون ظرف‌هایی قرار می‌دهند و به داخل کوره وارد می‌کنند و از این ‌طریق ظرف‌هایی که قبلاً وارد کوره شده و در آن حرارت دیده است، از انتهای دیگر به خارج رانده می‌شود.
broader: کوره مداوم
preferred label: pusher furnace @en
type: Concept