زباله‌سوز چرخان
scope note: باله‌سوزی با سوختارخانۀ (combustion chamber) چرخان
broader: زباله‌سوز
preferred label: rotary kiln incinerator @en
type: Concept

زباله‌سوز
preferred label: refuse incinerator @en
type: Concept
narrower: زباله‌سوز چرخان