پهنای باند
preferred label: bandwidth @en
type: Concept
narrower: پهنای باند تصویر

پهنای باند تصویر
scope note: پهنای باند لازم برای حمل نشانک/ سیگنال تصویر که اندازۀ آن به ظرافت‌های سامانه بستگی دارد.
broader: پهنای باند
preferred label: video bandwidth @en
type: Concept