شیرفلکه توازن
scope note: هریک از شیرفلکه‌های بزرگ زیردریایی که امکان ورود آب را به مخزن‌های ترازه فراهم می‌کند تا زیردریایی بتواند به عمق فرو رود.
related: زیردریایی
broader: سوپاپ
preferred label: kingstone valve @en
type: Concept

زیردریایی
preferred label: submarine @en
type: Concept
related: شیرفلکه توازن

سوپاپ
preferred label: valve (mechanical) @en
type: Concept
narrower: شیرفلکه توازن