افزاره نمایش
preferred label: display device @en
type: Concept
narrower: نمایشگر افقی

نمایشگر افقی
scope note: صفحۀ ‌نمایش الکترونیکی در هواگَرد که اطلاعات ناوبری و داده‌های مربوط به مأموریت و روش‌های پروازی را نشان می‌دهد؛ اطلاعات راداری و تلویزیونی نیز می‌تواند به‌صورت نقشه یا تصویر جداگانه بر روی آن دیده شود.
broader: افزاره نمایش
preferred label: horizontal situation display @en
type: Concept