افزاره نمایش
preferred label: display device @en
type: Concept
narrower: نمایشگر حجمی

نمایشگر حجمی
scope note: نمایشگری که در حجمی از فضا، اعم از فضای مجازی یا واقعی، تصویری سه‌بعدی نمایش می‌‌‌دهد.
broader: افزاره نمایش
preferred label: volumetric display @en
type: Concept