مهندس
preferred label: engineer @en
type: Concept
related: سرگذشت

تاریخ
preferred label: history @en
type: Concept
related: سرگذشت

سرگذشت
alternative label: شرح حال
scope note: کتابی که در آن زندگی‌نامۀ شخصیتی شرح داده شده باشد.
related: تاریخ
related: مهندس
preferred label: biography @en
type: Concept