بافه الکتریکی
preferred label: electric cable @en
type: Concept
narrower: بافه هوایی

بافه هوایی
alternative label: کابل هوایی
scope note: بافه‌ای که در فاصلۀ میان ساختمان‌ها یا تیرها در هوا معلق است.
broader: بافه الکتریکی
preferred label: aerial cable @en
type: Concept