بافه ساختمند
alternative label: کابل ساختمند
scope note: بافه‌ای با طراحی صحیح و مطابق با طرحی استاندارد برای اجرا و توسعه و گسترش
broader: بافه الکتریکی
preferred label: structured cable @en
type: Concept

بافه الکتریکی
preferred label: electric cable @en
type: Concept
narrower: بافه ساختمند