اتصال‌دهنده الکتریکی
preferred label: electric connector @en
type: Concept
narrower: اتصال‌دهنده نر

اتصال‌دهنده نر
scope note: اتصال‌دهنده‌ای متناظر با اتصال‌دهندۀ ماده که زائدۀ برجستۀ آن درون حفرۀ اتصال‌دهندۀ ماده قرار می‌گیرد تا اتصال الکتریکی مطلوبی ایجاد شود.
broader: اتصال‌دهنده الکتریکی
preferred label: male connector @en
type: Concept