واگردان فاز
scope note: واگردانی که انرژی برق را همراه با تغییر در تعداد فازهای آن منتقل می‌کند.
broader: واگردان الکتریکی
preferred label: phase converter @en
type: Concept

واگردان الکتریکی
preferred label: electric converter @en
type: Concept
narrower: واگردان فاز