چراغ جلو
preferred label: headlight @en
type: Concept
narrower: چراغ نورپایین

چراغ نورپایین
scope note: در چراغ جلوهای دوقلو چراغی که در کاسه‌چراغ بیرونی نصب شده است و از آن برای دید محدود راننده در شب استفاده می‌شود.
broader: چراغ جلو
preferred label: outer headlight @en
type: Concept