لامپ الکتریکی
preferred label: electric lamp @en
type: Concept
narrower: چراغ هشدار

چراغ هشدار
scope note: چراغی که با کشیدن دسته‌راهنما به سمت راننده به‌سرعت روشن و خاموش می‌شود و از آن برای هشداردهی به رانندگان دیگر استفاده می‌شود.
broader: لامپ الکتریکی
preferred label: headlight flasher @en
type: Concept