رسوب‌ده ایستابرقی
alternative label: رسوب‌ده الکترواستاتیکی
scope note: دستگاهی که با استفاده از ولتاژ بالای جریان مستقیم و ایجاد محیط یونیده در میدان الکتریکی، ذرات موجود در گاز ورودی را باردار می‌کند و به طرف الکترود جمع‌آورنده می‌راند و از گاز جدا می‌کند.
broader: افزاره ایستابرق
preferred label: electrostatic precipitator @en
type: Concept

افزاره ایستابرق
preferred label: electrostatic device @en
type: Concept
narrower: رسوب‌ده ایستابرقی