تقویت‌کننده (الکترونیکی)
preferred label: amplifier (electronic) @en
type: Concept
narrower: تقویت‌کننده هم‌فرود

تقویت‌کننده هم‌فرود
scope note: تقویت‌کننده‌ای که فقط در صورتی علامت خروجی تولید می‌کند که دو علامت ورودی هم‌زمان به آن برسند.
broader: تقویت‌کننده (الکترونیکی)
preferred label: coincidence amplifier @en
type: Concept