چاپگر (رایانه)
preferred label: printer (computer) @en
type: Concept
narrower: چاپگر لیزری

چاپگر لیزری
scope note: چاپگری که در آن از پرتوِ لیزر برای نشاندن جوهر بر کاغذ استفاده شود.
broader: چاپگر (رایانه)
preferred label: laser printer @en
type: Concept