چاپگر (رایانه)
preferred label: printer (computer) @en
type: Concept
narrower: چاپگر رسید

چاپگر رسید
scope note: نوعی افزاره که برای مشتری رسید چاپ می‌کند.
broader: چاپگر (رایانه)
preferred label: receipt printer @en
type: Concept