رانه نوار
alternative label: نوارگردان
scope note: افزاره‌ای همچون ضبط صوت که داده‌ها را از روی نوار می‌خواند و بر روی نوار می‌نویسد.
related: ذخیره‌ساز نوار مغناطیسی
broader: تجهیزات جانبی رایانه
preferred label: tape drive @en
type: Concept

ذخیره‌ساز نوار مغناطیسی
preferred label: magnetic tape storage @en
type: Concept
related: رانه نوار

تجهیزات جانبی رایانه
preferred label: computer peripheral equipment @en
type: Concept
narrower: رانه نوار