غلته همرفتی افقی
alternative label: غلته لایه مرزی
scope note: تاوه‌های افقی پادچرخشی (counter rotating) که عموماً در لایۀ مرزی همرَفتی رخ می‌دهند.
broader: لایه مرزی
preferred label: horizontal convective rolls @en
type: Concept

لایه مرزی
preferred label: boundary layer @en
type: Concept
narrower: غلته همرفتی افقی