بزرگ‌رایانه
scope note: رایانه‌ای سریع و بزرگ با قابلیت پردازش زیاد
broader: رایانه رقمی
preferred label: mainframe computer @en
type: Concept

رایانه رقمی
preferred label: digital computer @en
type: Concept
narrower: بزرگ‌رایانه