الکترود کالومل
alternative label: نیم‌پیل کالومل
scope note: نوعی الکترود مرجع بر پایۀ جیوه‌ـ جیوه‌کلرید (کالومل) با پتانسیل مشخص که در مطالعات برق‌شیمیایی/ الکتروشیمیایی و خوردگی برای اندازه‌گیری پتانسیل الکتریکی دیگر الکترودها به‌ کار می‌رود.
broader: الکترود
preferred label: calomel electrode @en
type: Concept

الکترود
preferred label: electrode @en
type: Concept
narrower: الکترود کالومل