الکترود هیدروژن
preferred label: hydrogen electrode @en
type: Concept
narrower: الکترود استاندارد هیدروژن

الکترود استاندارد هیدروژن
scope note: الکترود پلاتین در یک مولار اسید در مجاور گاز هیدروژن در فشار یک بار
broader: الکترود هیدروژن
preferred label: standard hydrogen electrode @en
type: Concept