الکترود مرجع
scope note: الکترود قطبش‌ناپذیری که پتانسیل‌های تکرارپذیر بالایی تولید می‌کند و در اندازه‌گیری PH و آنالیز قطبش‌نگاری به کار میرود.
broader: الکترود
preferred label: reference electrode @en
type: Concept

الکترود
preferred label: electrode @en
type: Concept
narrower: الکترود مرجع