حصار برف‌گیر
scope note: دیواره‌ای که با کوبیدن تیرک‌های چوبی در زمین و بستن آنها به یکدیگر در نزدیکی خط ایجاد می‌کنند تا از ریزش برف به حریم خط جلوگیری شود.
broader: حصار
preferred label: snow fencing @en
type: Concept

حصار
preferred label: fence @en
type: Concept
narrower: حصار برف‌گیر