آشکارساز
preferred label: detector @en
type: Concept
narrower: آشکارساز لبه

آشکارساز لبه
scope note: عملگری برای مشخص کردن آن نواحی از تصویر که تغییر ناگهانی در درجۀ ‌خاکستری دارند.
broader: آشکارساز
preferred label: edge detector @en
type: Concept