آشکارساز انتهای قطار
scope note: نوعی گیرنده که ازطریق آشکارسازی نشانک‌های دستگاه انتهای قطار لوکوموتیوران را از پیوستگی واگن‌های قطار مطمئن می‌سازد.
related: واگن راه‌آهن
broader: آشکارساز
preferred label: end-of-train detector @en
type: Concept

واگن راه‌آهن
preferred label: railroad car @en
type: Concept
related: آشکارساز انتهای قطار

آشکارساز
preferred label: detector @en
type: Concept
narrower: آشکارساز انتهای قطار