آشکارساز داغی سرمحور
scope note: افزاره‌ای الکتریکی برای اندازه‌گیری دمای نسبی جعبۀ سرمحور (bearing) خط‌نوردها که در کنار خطوط اصلی راه‌آهن در نقاط خاص نصب می‌شود.
broader: آشکارساز
preferred label: hot-box detector @en
type: Concept

آشکارساز
preferred label: detector @en
type: Concept
narrower: آشکارساز داغی سرمحور