آشکارساز سوزن
scope note: فزاره‌ای برای اطمینان یافتن از درستی تنظیم جهت سوزن پیش از نشان دادن نمای آزاد
broader: آشکارساز
preferred label: point detector @en
type: Concept

آشکارساز
preferred label: detector @en
type: Concept
narrower: آشکارساز سوزن