آشکارساز ذرات
preferred label: particle detector @en
type: Concept
narrower: آشکارساز یونش شعله‌ای

آشکارساز یونش شعله‌ای
scope note: ابزاری در سوانگاری گازی که برای تجزیۀ مولکول‌های طبیعی حل‌شده در شعله و تبدیل آنها به ذرات باردار به کار می‌رود و تغییرات رسانندگی را اندازه‌گیری می‌کند.
broader: آشکارساز ذرات
preferred label: flame ionization detector @en
type: Concept