آشکارساز تابش
preferred label: radiation detector @en
type: Concept
narrower: آشکارساز سوسوزن

تکثیرکن فوتونی
preferred label: photomultiplier @en
type: Concept
related: آشکارساز سوسوزن

آشکارساز سوسوزن
alternative label: سوسوسنج
scope note: ابزاری که در آن تابش یوننده تبدیل به فوتون‌های مرئی می‌شود و این فوتون‌ها با تکثیرکن فوتونی به‌صورت نشانک‌ها/ سیگنال‌های قابل‌شمارش درمی‌آیند.
related: تکثیرکن فوتونی
broader: آشکارساز تابش
preferred label: scintillation detector @en
type: Concept