نزداحسگر القایی
scope note: نزداحسگری که براساس تغییر ضریب القاوری ناشی از حضور شیء فلزی کار می‌کند.
broader: نزداحسگر
preferred label: inductive proximity sensor @en
type: Concept

نزداحسگر
preferred label: proximity sensor @en
type: Concept
narrower: نزداحسگر القایی