رهبندی‌سنج
preferred label: impedance meter @en
type: Concept
narrower: رهبندی‌سنج برداری

رهبندی‌سنج برداری
scope note: دستگاهی برای اندازه‌گیری نسبت بین ولتاژ و جریان و نیز اختلاف فاز بین آن دو
broader: رهبندی‌سنج
preferred label: vector impedance meter @en
type: Concept