شارش‌سنج موی‌لوله‌ای
scope note: ابزاری برای آزمودن رفتار شارش‌شناختی بسپارهای مذاب با وارد کردن نیرو به مذاب در یک موی‌لوله
broader: شارش‌سنج (بسپار)
preferred label: capillary rheometer @en
type: Concept

شارش‌سنج (بسپار)
preferred label: rheometer @en
type: Concept
narrower: شارش‌سنج موی‌لوله‌ای