شارش‌سنج (بسپار)
preferred label: rheometer @en
type: Concept
narrower: شارش‌سنج مخروط‌صفحه‌ای

شارش‌سنج مخروط‌صفحه‌ای
scope note: نوعی شارش‌سنج چرخان با دقت بسیار زیاد که در آن یک مخروط تندزوایه در مجاورت با یک صفحۀ تخت است، شیبِ مخروط کم و آهنگ برش و مقدار آن نیز، از روی صفحه تا بالای مخروط، تقریباً ثابت است.
broader: شارش‌سنج (بسپار)
preferred label: cone-and-plate rheometer @en
type: Concept