شارش‌سنج (بسپار)
preferred label: rheometer @en
type: Concept
narrower: شارش‌سنج پربرش

شارش‌سنج پربرش
scope note: شارش‌سنجی که در سرعت‌های برشی بالا کار می‌کند.
broader: شارش‌سنج (بسپار)
preferred label: high shear rate rheometer @en
type: Concept