عرض‌سنج‌ ریل سوم
scope note: ابزاری برای پایش فاصلۀ ریل سوم با ریل حرکتی
broader: عرض‌سنج
preferred label: third rail gauge tool @en
type: Concept

عرض‌سنج
preferred label: track gauge tool @en
type: Concept
narrower: عرض‌سنج‌ ریل سوم