گرانی‌سنج ناپایدارنما
scope note: گرانی‌سنجی که در آن نیروی گرانی با نیروی بازدارنده، نزدیک به حالت تعادل ناپایدار است.
broader: گرانی‌سنج
preferred label: astatized gravimeter @en
type: Concept

گرانی‌سنج
preferred label: gravimeter @en
type: Concept
narrower: گرانی‌سنج ناپایدارنما