حمله شیمیایی
preferred label: chemical attack @en
type: Concept
narrower: حمله برخوردی

حمله برخوردی
alternative label: خوردگی برخوردی
scope note: نوعی خوردگی فرسایشی موضعی که براثر تلاطم یا برخورد جریان مایع به وجود می‌آید.
broader: حمله شیمیایی
preferred label: impingement attack @en
type: Concept