نشانگر (سنج‌افزار)
preferred label: indicator (instrument) @en
type: Concept
narrower: نشانگر مقیاس

نشانگر مقیاس
scope note: دستگاهی دارای مقیاس مدرج لگاریتمی برای تعیین مقیاس طبیعی نقشه بر پایۀ نشانه‌های مقیاس ترسیمی یا بازه‌های عرض جغرافیایی روی نقشه
broader: نشانگر (سنج‌افزار)
preferred label: scale indicator @en
type: Concept