مغناطیس‌سنج هوابرد
scope note: نوعی دستگاه هوابُرد برای اندازه‌گیری میدان مغناطیسی زمین
broader: مغناطیس‌سنج
preferred label: airborne magnetometer @en
type: Concept

مغناطیس‌سنج
preferred label: magnetometer @en
type: Concept
narrower: مغناطیس‌سنج هوابرد