حمله شیمیایی
preferred label: chemical attack @en
type: Concept
narrower: خوردگی خط آب

خوردگی خط آب
scope note: نوعی خوردگی که در آن مرز میان جدارۀ لوله یا ظرف فلزی و شارۀ درون آن هم‌زمان تحت تأثیر پیل اختلاف‌دَمشی (differential aeration cell) و خوردگی شیاری قرار می‌گیرد.
broader: حمله شیمیایی
preferred label: waterline attack @en
type: Concept