مهندسی پزشکی
preferred label: medical engineering @en
type: Concept
related: مغناطیس‌سنج اسکوئیدی

مغناطیس‌سنج
preferred label: magnetometer @en
type: Concept
narrower: مغناطیس‌سنج اسکوئیدی

مغناطیس‌سنج اسکوئیدی
scope note: مغناطیس‌سنجی که بر مبنای اصول تداخلی کوانتومی اَبَررسانشی کار می‌کند.
related: مهندسی پزشکی
broader: مغناطیس‌سنج
preferred label: SQUID magnetometer @en
type: Concept