نم‌سنج پخشی
scope note: نم‌سنجی که بر پایۀ پخش بخار آب از یک غشای متخلخل کار می‌کند.
broader: نم‌سنج
preferred label: diffusion hygrometer @en
type: Concept

نم‌سنج
preferred label: hygrometer @en
type: Concept
narrower: نم‌سنج پخشی