نم‌سنج الکتریکی
scope note: نم‌سنجی که ویژگی‌های الکتریکی عنصر حساس آن با رطوبت جوّ تغییر می‌کند.
broader: نم‌سنج
preferred label: electrical hygrometer @en
type: Concept

نم‌سنج
preferred label: hygrometer @en
type: Concept
narrower: نم‌سنج الکتریکی