نم‌سنج طیفی
alternative label: نم‌سنج نورشناختی
scope note: نوعی نم‌سنج که مقدار رطوبت قابل‌بارش در یک منطقۀ معین از جوّ را با سنجش میزان تضعیف انرژی تابشی ناشی از نوارهای جذبی بخار آب تعیین می‌کند.
narrower: نم‌سنج جذب تفاضلی
broader: نم‌سنج
preferred label: spectral hygrometer @en
type: Concept

نم‌سنج جذب تفاضلی
preferred label: differential absorption hygrometer @en
type: Concept
broader: نم‌سنج طیفی

نم‌سنج
preferred label: hygrometer @en
type: Concept
narrower: نم‌سنج طیفی