ریزبین
preferred label: microscope @en
type: Concept
narrower: ریزبین دوچشمی

ریزبین دوچشمی
alternative label: میکروسکوپ دوچشمی
scope note: ریزبین/ میکروسکوپ مرکبی که مجهز به دوچشمی است و هم‌زمان برای هر دو چشم ناظر تصویربرداری می‌کند.
broader: ریزبین
preferred label: binocular microscope @en
type: Concept