ریزبین
preferred label: microscope @en
type: Concept
narrower: ریزبین گریزانهی

ریزبین گریزانهی
alternative label: میکروسکوپ مرکزگریزی
scope note: ریزبین/ میکروسکوپی که با آن نمونه‌های در حال گریزازمرکز را مشاهده می‌کنند.
broader: ریزبین
preferred label: centrifuge microscope @en
type: Concept